Target
Alpha-glucosidase MAL12
Ligand
BDBM50308260
Substrate
Meas. Tech.
ChEMBL_613790 (CHEMBL1069561)
IC50
24700±n/a nM
Citation
 Ferreira, SBSodero, ACCardoso, MFLima, ESKaiser, CRSilva, FPFerreira, VF Synthesis, biological activity, and molecular modeling studies of 1H-1,2,3-triazole derivatives of carbohydrates as alpha-glucosidases inhibitors. J Med Chem 53:2364-75 (2010)  
Target
Name:
Alpha-glucosidase MAL12
Synonyms:
α-Glucosidase MAL12_YEAST Maltase | alpha-Glucosidase (α-Glucosidase)
Type:
Protein
Mol. Mass.:
68084.32
Organism:
Saccharomyces cerevisiae
Description:
P53341
Residue:
584
  
Inhibitor
Name:
BDBM50308260
Synonyms:
1-O-Methyl-2,3-O-isopropylidene-5-[4-(tetrahydro-2H-pyran)-methyl)-1H-1,2,3-triazole-1-yl]-beta-D-ribofuranose | CHEMBL590279
Type:
Small organic molecule
Emp. Form.:
C17H27N3O6
Mol. Mass.:
369.4128
SMILES:
CO[C@@H]1O[C@H](Cn2cc(COC3CCCCO3)nn2)[C@H]2OC(C)(C)O[C@@H]12
: