Target
Adenosine receptor A1
Ligand
BDBM50199293
Substrate
Meas. Tech.
ChEMBL_613353 (CHEMBL1074290)
Ki
1.3±n/a nM
Citation
 Scheiff, ABYerande, SGEl-Tayeb, ALi, WInamdar, GSVasu, KKSudarsanam, VMüller, CE 2-Amino-5-benzoyl-4-phenylthiazoles: Development of potent and selective adenosine A1 receptor antagonists. Bioorg Med Chem 18:2195-203 (2010)  
Target
Name:
Adenosine receptor A1
Synonyms:
AA1R_RAT ADENOSINE A1 high Adenosine A1 receptor (A1) Adenosine receptors A1 | Adora1
Type:
Protein
Mol. Mass.:
36704.13
Organism:
Rattus norvegicus (rat)
Description:
Residue:
326
  
Inhibitor
Name:
BDBM50199293
Synonyms:
3-(4-(2,6-dioxo-1,3-dipropyl-2,3,6,7-tetrahydro-1H-purin-8-yl)bicyclo[2.2.2]octan-1-yl)propanoic acid Tonapofylline
Type:
Small organic molecule
Emp. Form.:
C22H32N4O4
Mol. Mass.:
416.5139
SMILES:
CCCn1c2[nH]c(nc2c(=O)n(CCC)c1=O)C12CCC(CCC(O)=O)(CC1)CC2
: