Target
Serine/threonine-protein kinase Chk2
Ligand
BDBM50309183
Substrate
Meas. Tech.
ChEMBL_608836 (CHEMBL1069055)
IC50
4400±n/a nM
Citation
 Hilton, SNaud, SCaldwell, JJBoxall, KBurns, SAnderson, VEAntoni, LAllen, CEPearl, LHOliver, AWWynne Aherne, GGarrett, MDCollins, I Identification and characterisation of 2-aminopyridine inhibitors of checkpoint kinase 2. Bioorg Med Chem 18:707-18 (2010)  
Target
Name:
Serine/threonine-protein kinase Chk2
Synonyms:
CDS1 CHK2 Checkpoint Kinase (Chk2) Serine/threonine-protein kinase Chek2 | Serine/threonine-protein kinase Chk1/2
Type:
Protein
Mol. Mass.:
60908.59
Organism:
Homo sapiens (Human)
Description:
O96017
Residue:
543
  
Inhibitor
Name:
BDBM50309183
Synonyms:
4-(2-amino-5-(3,5-dimethoxy-4-methylphenyl)pyridin-3-yl)-2-methoxyphenol | CHEMBL600865
Type:
Small organic molecule
Emp. Form.:
C21H22N2O4
Mol. Mass.:
366.4104
SMILES:
COc1cc(cc(OC)c1C)-c1cnc(N)c(c1)-c1ccc(O)c(OC)c1
: