Target
Dihydrofolate reductase
Ligand
BDBM18069
Substrate
Meas. Tech.
ChEMBL_608248 (CHEMBL1072437)
IC50
300±n/a nM
Citation
 Gangjee, AJain, HDPhan, JGuo, XQueener, SFKisliuk, RL 2,4-Diamino-5-methyl-6-substituted arylthio-furo[2,3-d]pyrimidines as novel classical and nonclassical antifolates as potential dual thymidylate synthase and dihydrofolate reductase inhibitors. Bioorg Med Chem 18:953-61 (2010)  
Target
Name:
Dihydrofolate reductase
Synonyms:
Dihydrofolate reductase (DHFR) | Tetrahydrofolate dehydrogenase
Type:
Enzyme
Mol. Mass.:
19884.75
Organism:
Mycobacterium avium
Description:
Recombinant Mycobacterium avium DHFR expressed in E. coli.
Residue:
181
  
Inhibitor
Name:
BDBM18069
Synonyms:
5-[(3,4,5-trimethoxyphenyl)methyl]pyrimidine-2,4-diamine TMP Trimethoprim (TMP) | US10870625, Compound TMP
Type:
Small organic molecule
Emp. Form.:
C14H18N4O3
Mol. Mass.:
290.3177
SMILES:
COc1cc(Cc2cnc(N)nc2N)cc(OC)c1OC
: