Target
Glycogen synthase kinase-3 beta
Ligand
BDBM50313065
Substrate
Meas. Tech.
ChEMBL_616299 (CHEMBL1102102)
Ki
8.3±n/a nM
Citation
 Arnost, MPierce, Ater Haar, ELauffer, DMadden, JTanner, KGreen, J 3-Aryl-4-(arylhydrazono)-1H-pyrazol-5-ones: Highly ligand efficient and potent inhibitors of GSK3beta. Bioorg Med Chem Lett 20:1661-4 (2010)  
Target
Name:
Glycogen synthase kinase-3 beta
Synonyms:
GSK-3 beta GSK3B Glycogen synthase kinase 3 beta (GSK3B) Glycogen synthase kinase-3 beta (GSK-3B) Glycogen synthase kinase-3 beta (GSK3B) Glycogen synthase kinase-3beta (GSK3B) | Serine/threonine-protein kinase GSK3B
Type:
Enzyme
Mol. Mass.:
46756.38
Organism:
Homo sapiens (Human)
Description:
P49841
Residue:
420
  
Inhibitor
Name:
BDBM50313065
Synonyms:
(Z)-4-(2-(3-(4-methoxypyridin-3-yl)-5-oxo-1H-pyrazol-4(5H)-ylidene)hydrazinyl)benzonitrile | CHEMBL1081102
Type:
Small organic molecule
Emp. Form.:
C16H12N6O2
Mol. Mass.:
320.3055
SMILES:
COc1ccncc1-c1[nH][nH]c(=O)c1N=Nc1ccc(cc1)C#N
: