Target
Cyclin-dependent kinase 2
Ligand
BDBM50313051
Substrate
Meas. Tech.
ChEMBL_616300 (CHEMBL1102103)
Ki
62±n/a nM
Citation
 Arnost, MPierce, Ater Haar, ELauffer, DMadden, JTanner, KGreen, J 3-Aryl-4-(arylhydrazono)-1H-pyrazol-5-ones: Highly ligand efficient and potent inhibitors of GSK3beta. Bioorg Med Chem Lett 20:1661-4 (2010)  
Target
Name:
Cyclin-dependent kinase 2
Synonyms:
CDK2 CDK2_HUMAN Cell division protein kinase 2 Protein cereblon/Cyclin-dependent kinase 2 | p33 protein kinase
Type:
Enzyme Subunit
Mol. Mass.:
33938.17
Organism:
Homo sapiens (Human)
Description:
P24941
Residue:
298
  
Inhibitor
Name:
BDBM50313051
Synonyms:
(Z)-3-(4-methoxyphenyl)-4-(2-(pyridin-3-yl)hydrazono)-1H-pyrazol-5(4H)-one | CHEMBL1076721
Type:
Small organic molecule
Emp. Form.:
C15H13N5O2
Mol. Mass.:
295.296
SMILES:
COc1ccc(cc1)-c1[nH][nH]c(=O)c1N=Nc1cccnc1
: