Target
Receptor-type tyrosine-protein kinase FLT3
Ligand
BDBM50313051
Substrate
Meas. Tech.
ChEMBL_616301 (CHEMBL1102104)
Ki
130±n/a nM
Citation
 Arnost, MPierce, Ater Haar, ELauffer, DMadden, JTanner, KGreen, J 3-Aryl-4-(arylhydrazono)-1H-pyrazol-5-ones: Highly ligand efficient and potent inhibitors of GSK3beta. Bioorg Med Chem Lett 20:1661-4 (2010)  
Target
Name:
Receptor-type tyrosine-protein kinase FLT3
Synonyms:
CD135 FL cytokine receptor FLK2 FLT3 Fetal liver kinase-2 Fms-like tyrosine kinase 3 (Flt-3) STK-1 Stem cell tyrosine kinase 1
Type:
Enzyme
Mol. Mass.:
112888.62
Organism:
Homo sapiens (Human)
Description:
P36888
Residue:
993
  
Inhibitor
Name:
BDBM50313051
Synonyms:
(Z)-3-(4-methoxyphenyl)-4-(2-(pyridin-3-yl)hydrazono)-1H-pyrazol-5(4H)-one | CHEMBL1076721
Type:
Small organic molecule
Emp. Form.:
C15H13N5O2
Mol. Mass.:
295.296
SMILES:
COc1ccc(cc1)-c1[nH][nH]c(=O)c1N=Nc1cccnc1
: