Target
Carbonic anhydrase 4
Ligand
BDBM50317400
Substrate
Meas. Tech.
ChEMBL_631615 (CHEMBL1106609)
IC50
246±n/a nM
Citation
 Vernier, WChong, WRewolinski, DGreasley, SPauly, TShaw, MDinh, DFerre, RAMeador, JWNukui, SOrnelas, MPaz, RLReyner, E Thioether benzenesulfonamide inhibitors of carbonic anhydrases II and IV: structure-based drug design, synthesis, and biological evaluation. Bioorg Med Chem 18:3307-19 (2010)  
Target
Name:
Carbonic anhydrase 4
Synonyms:
CA-IV CAH4_HUMAN Carbonic anhydrase Carbonic anhydrase IV (CA IV)
Type:
Enzyme
Mol. Mass.:
35037.98
Organism:
Homo sapiens (Human)
Description:
P22748
Residue:
312
  
Inhibitor
Name:
BDBM50317400
Synonyms:
5-(Aminosulfonyl)-N-(3-methoxypropyl)-2-(phenylthio)-nicotinamide N-(3-methoxypropyl)-2-(phenylsulfanyl)-5-sulfamoylpyridine-3-carboxamide
Type:
Small organic molecule
Emp. Form.:
C16H19N3O4S2
Mol. Mass.:
381.47
SMILES:
COCCCNC(=O)c1cc(cnc1Sc1ccccc1)S(N)(=O)=O
: