Target
Adenosine receptor A1
Ligand
BDBM50318273
Substrate
Meas. Tech.
ChEMBL_629506 (CHEMBL1120795)
Ki
1081.6±n/a nM
Citation
 Taliani, SLa Motta, CMugnaini, LSimorini, FSalerno, SMarini, AMDa Settimo, FCosconati, SCosimelli, BGreco, GLimongelli, VMarinelli, LNovellino, ECiampi, ODaniele, STrincavelli, MLMartini, C Novel N2-substituted pyrazolo[3,4-d]pyrimidine adenosine A3 receptor antagonists: inhibition of A3-mediated human glioblastoma cell proliferation. J Med Chem 53:3954-63 (2010)  
Target
Name:
Adenosine receptor A1
Synonyms:
A1 adenosine receptor (hA1) AA1R_HUMAN ADORA1 Adenosine A1-receptor Adenosine receptor A1 (hA1) | Adenosine transporter (AdT)
Type:
G Protein-Coupled Receptor (GPCR)
Mol. Mass.:
36520.92
Organism:
Homo sapiens (Human)
Description:
P30542
Residue:
326
  
Inhibitor
Name:
BDBM50318273
Synonyms:
3-chloro-N-(2-methyl-6-phenyl-2H-pyrazolo[3,4-d]pyrimidin-4-yl)benzamide | CHEMBL1098109
Type:
Small organic molecule
Emp. Form.:
C19H14ClN5O
Mol. Mass.:
363.8
SMILES:
Cn1cc2c(NC(=O)c3cccc(Cl)c3)nc(nc2n1)-c1ccccc1
: