Target
Adenosine receptor A3
Ligand
BDBM50318281
Substrate
Meas. Tech.
ChEMBL_629508 (CHEMBL1120797)
Ki
45.2±n/a nM
Citation
 Taliani, SLa Motta, CMugnaini, LSimorini, FSalerno, SMarini, AMDa Settimo, FCosconati, SCosimelli, BGreco, GLimongelli, VMarinelli, LNovellino, ECiampi, ODaniele, STrincavelli, MLMartini, C Novel N2-substituted pyrazolo[3,4-d]pyrimidine adenosine A3 receptor antagonists: inhibition of A3-mediated human glioblastoma cell proliferation. J Med Chem 53:3954-63 (2010)  
Target
Name:
Adenosine receptor A3
Synonyms:
A3 adenosine receptor (hA3) ADORA3 | Adenosine A3 receptor (A3AR)
Type:
G Protein-Coupled Receptor (GPCR)
Mol. Mass.:
36197.32
Organism:
Homo sapiens (Human)
Description:
P0DMS8
Residue:
318
  
Inhibitor
Name:
BDBM50318281
Synonyms:
4-methoxy-N-(2-phenethyl-6-phenyl-2H-pyrazolo[3,4-d]pyrimidin-4-yl)benzamide | CHEMBL1097050
Type:
Small organic molecule
Emp. Form.:
C27H23N5O2
Mol. Mass.:
449.5038
SMILES:
COc1ccc(cc1)C(=O)Nc1nc(nc2nn(CCc3ccccc3)cc12)-c1ccccc1
: