Target
Macrophage colony-stimulating factor 1 receptor
Ligand
BDBM50321358
Substrate
Meas. Tech.
ChEMBL_640283 (CHEMBL1174608)
IC50
4.5±n/a nM
Citation
 Wilson, KJIllig, CRChen, JWall, MJBallentine, SKDesJarlais, RLChen, YSchubert, CDonatelli, RPetrounia, ICrysler, CSMolloy, CJChaikin, MAManthey, CLPlayer, MRTomczuk, BEMeegalla, SK Reducing ion channel activity in a series of 4-heterocyclic arylamide FMS inhibitors. Bioorg Med Chem Lett 20:3925-9 (2010)  
Target
Name:
Macrophage colony-stimulating factor 1 receptor
Synonyms:
CSF1R FMS Macrophage colony stimulating factor receptor Macrophage colony-stimulating factor 1 receptor (c-FMS) Proto-oncogene c-Fms c-fms | cFMS
Type:
Protein
Mol. Mass.:
107979.48
Organism:
Homo sapiens (Human)
Description:
P07333
Residue:
972
  
Inhibitor
Name:
BDBM50321358
Synonyms:
CHEMBL1172313 | N-(4-(6-aminopyridin-3-yl)-2-cyclohexenylphenyl)-4-cyano-1H-imidazole-2-carboxamide
Type:
Small organic molecule
Emp. Form.:
C22H20N6O
Mol. Mass.:
384.4338
SMILES:
Nc1ccc(cn1)-c1ccc(NC(=O)c2ncc([nH]2)C#N)c(c1)C1=CCCCC1
: