Target
Macrophage colony-stimulating factor 1 receptor
Ligand
BDBM50321374
Substrate
Meas. Tech.
ChEMBL_640283 (CHEMBL1174608)
IC50
1.9±n/a nM
Citation
 Wilson, KJIllig, CRChen, JWall, MJBallentine, SKDesJarlais, RLChen, YSchubert, CDonatelli, RPetrounia, ICrysler, CSMolloy, CJChaikin, MAManthey, CLPlayer, MRTomczuk, BEMeegalla, SK Reducing ion channel activity in a series of 4-heterocyclic arylamide FMS inhibitors. Bioorg Med Chem Lett 20:3925-9 (2010)  
Target
Name:
Macrophage colony-stimulating factor 1 receptor
Synonyms:
CSF1R FMS Macrophage colony stimulating factor receptor Macrophage colony-stimulating factor 1 receptor (c-FMS) Proto-oncogene c-Fms c-fms | cFMS
Type:
Protein
Mol. Mass.:
107979.48
Organism:
Homo sapiens (Human)
Description:
P07333
Residue:
972
  
Inhibitor
Name:
BDBM50321374
Synonyms:
4-cyano-N-(4-(1,3-dimethyl-2-(methylsulfonylimino)hexahydropyrimidin-5-yl)-2-(4,4-dimethylcyclohex-1-enyl)phenyl)-1H-imidazole-2-carboxamide | CHEMBL1169980
Type:
Small organic molecule
Emp. Form.:
C26H33N7O3S
Mol. Mass.:
523.65
SMILES:
CN1CC(CN(C)C1=NS(C)(=O)=O)c1ccc(NC(=O)c2ncc([nH]2)C#N)c(c1)C1=CCC(C)(C)CC1
: