Target
Cytochrome P450 2C9
Ligand
BDBM50321353
Substrate
Meas. Tech.
ChEMBL_640295 (CHEMBL1174620)
IC50
3±n/a nM
Citation
 Wilson, KJIllig, CRChen, JWall, MJBallentine, SKDesJarlais, RLChen, YSchubert, CDonatelli, RPetrounia, ICrysler, CSMolloy, CJChaikin, MAManthey, CLPlayer, MRTomczuk, BEMeegalla, SK Reducing ion channel activity in a series of 4-heterocyclic arylamide FMS inhibitors. Bioorg Med Chem Lett 20:3925-9 (2010)  
Target
Name:
Cytochrome P450 2C9
Synonyms:
(R)-limonene 6-monooxygenase CP2C9_HUMAN CYP2C9 Cytochrome P450 2C9 (CYP2C9 ) P-450MP P450 PB-1 | S-mephenytoin 4-hydroxylase
Type:
Enzyme
Mol. Mass.:
55636.33
Organism:
Homo sapiens (Human)
Description:
P11712
Residue:
490
  
Inhibitor
Name:
BDBM50321353
Synonyms:
4-cyano-N-(2-cyclohexenyl-4-(pyridin-4-yl)phenyl)-1H-imidazole-2-carboxamide | CHEMBL1172346
Type:
Small organic molecule
Emp. Form.:
C22H19N5O
Mol. Mass.:
369.4192
SMILES:
O=C(Nc1ccc(cc1C1=CCCCC1)-c1ccncc1)c1ncc([nH]1)C#N
: