Target
Cytochrome P450 3A4
Ligand
BDBM50321353
Substrate
Meas. Tech.
ChEMBL_640296 (CHEMBL1174621)
IC50
87±n/a nM
Citation
 Wilson, KJIllig, CRChen, JWall, MJBallentine, SKDesJarlais, RLChen, YSchubert, CDonatelli, RPetrounia, ICrysler, CSMolloy, CJChaikin, MAManthey, CLPlayer, MRTomczuk, BEMeegalla, SK Reducing ion channel activity in a series of 4-heterocyclic arylamide FMS inhibitors. Bioorg Med Chem Lett 20:3925-9 (2010)  
Target
Name:
Cytochrome P450 3A4
Synonyms:
Albendazole monooxygenase CP3A4_HUMAN CYP3A4 CYPIIIA4 Cytochrome P450 3A4 (CYP3A4) Nifedipine oxidase Taurochenodeoxycholate 6-alpha-hydroxylase
Type:
Enzyme
Mol. Mass.:
57349.57
Organism:
Homo sapiens (Human)
Description:
Residue:
503
  
Inhibitor
Name:
BDBM50321353
Synonyms:
4-cyano-N-(2-cyclohexenyl-4-(pyridin-4-yl)phenyl)-1H-imidazole-2-carboxamide | CHEMBL1172346
Type:
Small organic molecule
Emp. Form.:
C22H19N5O
Mol. Mass.:
369.4192
SMILES:
O=C(Nc1ccc(cc1C1=CCCCC1)-c1ccncc1)c1ncc([nH]1)C#N
: