Target
Acetylcholinesterase
Ligand
BDBM10613
Substrate
Meas. Tech.
ChEMBL_642168 (CHEMBL1176719)
IC50
760±n/a nM
Citation
 Yu, QSHolloway, HWLuo, WLahiri, DKBrossi, AGreig, NH Long-acting anticholinesterases for myasthenia gravis: synthesis and activities of quaternary phenylcarbamates of neostigmine, pyridostigmine and physostigmine. Bioorg Med Chem 18:4687-93 (2011)  
Target
Name:
Acetylcholinesterase
Synonyms:
ACES_HUMAN Acetylcholinesterase (AChE) | Acetylcholinesterase (human AChE)
Type:
Enzyme
Mol. Mass.:
67792.70
Organism:
Homo sapiens (Human)
Description:
P22303
Residue:
614
  
Inhibitor
Name:
BDBM10613
Synonyms:
(3aS)-1,3a,8-trimethyl-1H,2H,3H,3aH,8H,8aH-pyrrolo[2,3-b]indol-5-yl N-[4-(propan-2-yl)phenyl]carbamate Physostigmine Carbamate 18a
Type:
Small organic molecule
Emp. Form.:
C23H29N3O2
Mol. Mass.:
379.4953
SMILES:
CC(C)c1ccc(NC(=O)Oc2ccc3N(C)C4N(C)CC[C@@]4(C)c3c2)cc1
: