Target
Ephrin type-A receptor 2
Ligand
BDBM50321943
Substrate
Meas. Tech.
ChEMBL_642432 (CHEMBL1177625)
IC50
10000±n/a nM
Citation
 Huang, HMa, JShi, JMeng, LJiang, HDing, JLiu, H Discovery of novel purine derivatives with potent and selective inhibitory activity against c-Src tyrosine kinase. Bioorg Med Chem 18:4615-24 (2011)  
Target
Name:
Ephrin type-A receptor 2
Synonyms:
ECK EPHA2_HUMAN Epithelial cell kinase | Tyrosine-protein kinase receptor ECK
Type:
PROTEIN
Mol. Mass.:
108260.70
Organism:
Homo sapiens (Human)
Description:
ChEMBL_1505248
Residue:
976
  
Inhibitor
Name:
BDBM50321943
Synonyms:
CHEMBL1172957 | N-(4-Aminosulfonylphenyl)-2-morpholino-9H-purin-6-amine
Type:
Small organic molecule
Emp. Form.:
C15H17N7O3S
Mol. Mass.:
375.406
SMILES:
NS(=O)(=O)c1ccc(Nc2nc(nc3nc[nH]c23)N2CCOCC2)cc1
: