Target
Proto-oncogene tyrosine-protein kinase Src
Ligand
BDBM50321949
Substrate
Meas. Tech.
ChEMBL_642324 (CHEMBL1177350)
IC50
>10000±n/a nM
Citation
 Huang, HMa, JShi, JMeng, LJiang, HDing, JLiu, H Discovery of novel purine derivatives with potent and selective inhibitory activity against c-Src tyrosine kinase. Bioorg Med Chem 18:4615-24 (2011)  
Target
Name:
Proto-oncogene tyrosine-protein kinase Src
Synonyms:
Calmodulin/Proto-oncogene tyrosine-protein kinase Src Proto-oncogene c-Src SRC SRC_HUMAN V-src sarcoma (Schmidt-Ruppin A-2) viral oncogene homolog (avian) p60-Src | pp60c-src
Type:
Protein
Mol. Mass.:
59838.60
Organism:
Homo sapiens (Human)
Description:
P12931
Residue:
536
  
Inhibitor
Name:
BDBM50321949
Synonyms:
9-benzyl-2-morpholino-N-phenyl-9H-purin-6-amine | CHEMBL1173421
Type:
Small organic molecule
Emp. Form.:
C22H22N6O
Mol. Mass.:
386.4497
SMILES:
C(c1ccccc1)n1cnc2c(Nc3ccccc3)nc(nc12)N1CCOCC1
: