Target
Epidermal growth factor receptor
Ligand
BDBM50321990
Substrate
Meas. Tech.
ChEMBL_642443 (CHEMBL1177399)
IC50
9830±n/a nM
Citation
 Lv, PCLi, HQSun, JZhou, YZhu, HL Synthesis and biological evaluation of pyrazole derivatives containing thiourea skeleton as anticancer agents. Bioorg Med Chem 18:4606-14 (2011)  
Target
Name:
Epidermal growth factor receptor
Synonyms:
EGF Receptor Substrate EGFR_HUMAN ERBB1 Epidermal Growth Factor Receptor erbB-1 Epidermal growth factor receptor (EGFR) HER1 Proto-oncogene c-ErbB-1 Tyrosine-Protein Kinase ErbB-1
Type:
Receptor Kinase Domain
Mol. Mass.:
134279.59
Organism:
Homo sapiens (Human)
Description:
P00533
Residue:
1210
  
Inhibitor
Name:
BDBM50321990
Synonyms:
3-(3,4-Dibromophenyl)-5-p-tolyl-4,5-dihydro-1H-pyrazole-1-carbothioamide | CHEMBL1173262
Type:
Small organic molecule
Emp. Form.:
C17H15Br2N3S
Mol. Mass.:
453.194
SMILES:
Cc1ccc(cc1)C1CC(=NN1C(N)=S)c1ccc(Br)c(Br)c1
: