Target
Carbonic anhydrase 4
Ligand
BDBM11625
Substrate
Meas. Tech.
ChEMBL_643926 (CHEMBL1211825)
Ki
15±n/a nM
Citation
 Avvaru, BSWagner, JMMaresca, AScozzafava, ARobbins, AHSupuran, CTMcKenna, R Carbonic anhydrase inhibitors. The X-ray crystal structure of human isoform II in adduct with an adamantyl analogue of acetazolamide resides in a less utilized binding pocket than most hydrophobic inhibitors. Bioorg Med Chem Lett 20:4376-81 (2010)  
Target
Name:
Carbonic anhydrase 4
Synonyms:
CA-IV CAH4_HUMAN Carbonic anhydrase Carbonic anhydrase IV (CA IV)
Type:
Enzyme
Mol. Mass.:
35037.98
Organism:
Homo sapiens (Human)
Description:
P22748
Residue:
312
  
Inhibitor
Name:
BDBM11625
Synonyms:
2-N-(4-amino-3-chloro-5-fluorobenzene)-1,3,4-thiadiazole-2,5-disulfonamide CHEMBL71611 | aminobenzolamide 18
Type:
Small organic molecule
Emp. Form.:
C8H7ClFN5O4S3
Mol. Mass.:
387.819
SMILES:
Nc1c(F)cc(cc1Cl)S(=O)(=O)Nc1nnc(s1)S(N)(=O)=O
: