Target
Delta-type opioid receptor
Ligand
BDBM21121
Substrate
Meas. Tech.
ChEMBL_702692 (CHEMBL1657628)
Ki
0.360000±n/a nM
Citation
 Cowell, SMHanlon, KE Development of potent µ and d opioid agonists with high lipophilicity. J Med Chem 54:382-6 (2011)  
Target
Name:
Delta-type opioid receptor
Synonyms:
D-OR-1 Delta opioid receptor OPIATE Delta OPRD1 OPRK1 | opioid receptor, delta 1
Type:
G Protein-Coupled Receptor (GPCR)
Mol. Mass.:
40382.98
Organism:
Homo sapiens (Human)
Description:
Competition binding assays were carried out using membrane preparations from transfected HN9.10 cells that constitutively expressed the delta opioid receptor.
Residue:
372
  
Inhibitor
Name:
BDBM21121
Synonyms:
(2S)-2-amino-3-(4-hydroxy-2,6-dimethylphenyl)-N-[(1R)-1-[({[(2S)-1-oxo-3-phenyl-1-[4-(N-phenylpropanamido)piperidin-1-yl]propan-2-yl]carbamoyl}methyl)carbamoyl]ethyl]propanamide | 4-anilidopiperidine, 16
Type:
Peptide-like ligand
Emp. Form.:
C39H50N6O6
Mol. Mass.:
698.8509
SMILES:
CCC(=O)N(C1CCN(CC1)C(=O)[C@H](Cc1ccccc1)NC(=O)CNC(=O)[C@@H](C)NC(=O)[C@@H](N)Cc1c(C)cc(O)cc1C)c1ccccc1
: