Target
Cathepsin K
Ligand
BDBM50335277
Substrate
Meas. Tech.
ChEMBL_702784 (CHEMBL1655227)
Ki
0.46±n/a nM
Citation
 Frizler, MLohr, FFurtmann, NKläs, JGütschow, M Structural optimization of azadipeptide nitriles strongly increases association rates and allows the development of selective cathepsin inhibitors. J Med Chem 54:396-400 (2011)  
Target
Name:
Cathepsin K
Synonyms:
CATK_HUMAN CTSO Cathepsin O Cathepsin X
Type:
Enzyme
Mol. Mass.:
36975.68
Organism:
Homo sapiens (Human)
Description:
P43235
Residue:
329
  
Inhibitor
Name:
BDBM50335277
Synonyms:
CHEMBL1651351 | N-(Benzyloxycarbonyl)-isoleucyl-methylazalanine-nitrile
Type:
Small organic molecule
Emp. Form.:
C17H24N4O3
Mol. Mass.:
332.3975
SMILES:
CC[C@H](C)[C@H](NC(=O)OCc1ccccc1)C(=O)N(C)N(C)C#N
: