Target
D(3) dopamine receptor
Ligand
BDBM84636
Substrate
Meas. Tech.
ChEMBL_718438 (CHEMBL1680102)
Ki
1700±n/a nM
Citation
 Sromek, AWSi, YGZhang, TGeorge, SRSeeman, PNeumeyer, JL Synthesis and Biological Evaluation of N-Fluoroalkyl and 2-Fluoroalkoxy Substituted Aporphines: Potential PET Ligands for Dopamine D(2) Receptors. ACS Med Chem Lett 2:189-194 (2011)  
Target
Name:
D(3) dopamine receptor
Synonyms:
DOPAMINE D3 DRD3_HUMAN Dopamine D3 receptor (D3) Dopamine receptor Dopamine receptor D3
Type:
Mol. Mass.:
44243.43
Organism:
Homo sapiens (Human)
Description:
Residue:
400
  
Inhibitor
Name:
BDBM84636
Synonyms:
CHEMBL27559 | NPA-11-OH-R,(+)
Type:
Small organic molecule
Emp. Form.:
C19H21NO
Mol. Mass.:
279.3761
SMILES:
CCCN1CCc2cccc-3c2[C@H]1Cc1cccc(O)c-31
: