Target
Solute carrier family 22 member 6
Ligand
BDBM50328021
Substrate
Meas. Tech.
ChEMBL_749030 (CHEMBL1781815)
Ki
11000±n/a nM
Citation
 Kouznetsova, VLTsigelny, IFNagle, MANigam, SK Elucidation of common pharmacophores from analysis of targeted metabolites transported by the multispecific drug transporter-Organic anion transporter1 (Oat1). Bioorg Med Chem 19:3320-40 (2011)  
Target
Name:
Solute carrier family 22 member 6
Synonyms:
Oat1 S22A6_RAT rOAT1 renal organic anion transporter 1
Type:
PROTEIN
Mol. Mass.:
60784.17
Organism:
Rattus norvegicus
Description:
ChEMBL_838479
Residue:
551
  
Inhibitor
Name:
BDBM50328021
Synonyms:
(2-Hydroxy-benzoylamino)-acetic acid 2-Hydroxyhippuric acid NSC-87566 | Salicyluric Acid (50-80-%)
Type:
Small organic molecule
Emp. Form.:
C9H9NO4
Mol. Mass.:
195.1721
SMILES:
OC(=O)CNC(=O)c1ccccc1O
: