Target
Mu-type opioid receptor
Ligand
BDBM50347179
Substrate
Meas. Tech.
ChEMBL_753740 (CHEMBL1799577)
Ki
0.14±n/a nM
Citation
 Yamamoto, NFujii, HNemoto, TNakajima, RMomen, SIzumimoto, NHasebe, KMochizuki, HNagase, H Synthesis of new opioid derivatives with a propellane skeleton and their pharmacology: part 1. Bioorg Med Chem Lett 21:4104-7 (2011)  
Target
Name:
Mu-type opioid receptor
Synonyms:
M-OR-1 Mu opioid receptor OPIATE Mu OPRM_CAVPO
Type:
Enzyme Catalytic Domain
Mol. Mass.:
11165.58
Organism:
GUINEA PIG
Description:
P97266
Residue:
98
  
Inhibitor
Name:
BDBM50347179
Synonyms:
CHEMBL1797689
Type:
Small organic molecule
Emp. Form.:
C20H25NO3
Mol. Mass.:
327.4174
SMILES:
Oc1ccc2C[C@H]3N(CC4CC4)CC[C@@]4(CC(=O)CC[C@@]34O)c2c1
: