Target
Kappa-type opioid receptor
Ligand
BDBM50347177
Substrate
Meas. Tech.
ChEMBL_753738 (CHEMBL1799575)
Ki
0.03±n/a nM
Citation
 Yamamoto, NFujii, HNemoto, TNakajima, RMomen, SIzumimoto, NHasebe, KMochizuki, HNagase, H Synthesis of new opioid derivatives with a propellane skeleton and their pharmacology: part 1. Bioorg Med Chem Lett 21:4104-7 (2011)  
Target
Name:
Kappa-type opioid receptor
Synonyms:
Kappa Opioid Receptor OPRK1 Opiate Kappa 1 | mu/kappa opioid receptor
Type:
G Protein-Coupled Receptor (GPCR)
Mol. Mass.:
42744.99
Organism:
Cavia porcellus (domestic guinea pig)
Description:
P41144
Residue:
380
  
Inhibitor
Name:
BDBM50347177
Synonyms:
CHEMBL1797687
Type:
Small organic molecule
Emp. Form.:
C20H29NO2
Mol. Mass.:
315.4498
SMILES:
CCC12CCN(CC3(O)CC3)[C@H](Cc3ccc(O)cc13)C2(C)C
: