Target
Solute carrier family 15 member 2
Ligand
BDBM50350462
Substrate
Meas. Tech.
ChEMBL_762551 (CHEMBL1817008)
Ki
31000±n/a nM
Citation
 Pedretti, ADe Luca, LMarconi, CRegazzoni, LAldini, GVistoli, G Fragmental modeling of hPepT2 and analysis of its binding features by docking studies and pharmacophore mapping. Bioorg Med Chem 19:4544-51 (2011)  
Target
Name:
Solute carrier family 15 member 2
Synonyms:
Kidney H(+)/peptide cotransporter PEPT2 S15A2_HUMAN | SLC15A2
Type:
PROTEIN
Mol. Mass.:
81795.62
Organism:
Homo sapiens (Human)
Description:
ChEMBL_762551
Residue:
729
  
Inhibitor
Name:
BDBM50350462
Synonyms:
CHEMBL1814488
Type:
Small organic molecule
Emp. Form.:
C9H18N2O3
Mol. Mass.:
202.2508
SMILES:
CCCC[C@H](NC(=O)[C@H](C)N)C(O)=O
: