Target
Solute carrier family 15 member 2
Ligand
BDBM50169195
Substrate
Meas. Tech.
ChEMBL_762551 (CHEMBL1817008)
Ki
2100000±n/a nM
Citation
 Pedretti, ADe Luca, LMarconi, CRegazzoni, LAldini, GVistoli, G Fragmental modeling of hPepT2 and analysis of its binding features by docking studies and pharmacophore mapping. Bioorg Med Chem 19:4544-51 (2011)  
Target
Name:
Solute carrier family 15 member 2
Synonyms:
Kidney H(+)/peptide cotransporter PEPT2 S15A2_HUMAN | SLC15A2
Type:
PROTEIN
Mol. Mass.:
81795.62
Organism:
Homo sapiens (Human)
Description:
ChEMBL_762551
Residue:
729
  
Inhibitor
Name:
BDBM50169195
Synonyms:
(S)-2-[((S)-Pyrrolidine-2-carbonyl)-amino]-succinic acid Pro-Asp
Type:
Small organic molecule
Emp. Form.:
C9H14N2O5
Mol. Mass.:
230.2179
SMILES:
OC(=O)C[C@H](NC(=O)[C@@H]1CCCN1)C(O)=O
: