Target
Solute carrier family 15 member 2
Ligand
BDBM50169115
Substrate
Meas. Tech.
ChEMBL_762551 (CHEMBL1817008)
Ki
1700±n/a nM
Citation
 Pedretti, ADe Luca, LMarconi, CRegazzoni, LAldini, GVistoli, G Fragmental modeling of hPepT2 and analysis of its binding features by docking studies and pharmacophore mapping. Bioorg Med Chem 19:4544-51 (2011)  
Target
Name:
Solute carrier family 15 member 2
Synonyms:
Kidney H(+)/peptide cotransporter PEPT2 S15A2_HUMAN | SLC15A2
Type:
PROTEIN
Mol. Mass.:
81795.62
Organism:
Homo sapiens (Human)
Description:
ChEMBL_762551
Residue:
729
  
Inhibitor
Name:
BDBM50169115
Synonyms:
(S)-2-{2-[(S)-2-Amino-3-(1H-indol-3-yl)-propionylamino]-acetylamino}-3-(4-hydroxy-phenyl)-propionic acid | CHEMBL364928
Type:
Small organic molecule
Emp. Form.:
C22H24N4O5
Mol. Mass.:
424.4498
SMILES:
N[C@@H](Cc1c[nH]c2ccccc12)C(=O)NCC(=O)N[C@@H](Cc1ccc(O)cc1)C(O)=O
: