Target
5-hydroxytryptamine receptor 1A
Ligand
BDBM50354105
Substrate
Meas. Tech.
ChEMBL_770977 (CHEMBL1838216)
Ki
2500±n/a nM
Citation
 Slowinski, TStefanowicz, JDawidowski, MKleps, JCzuczwar, SAndres-Mach, MLuszczki, JJNowak, GStachowicz, KSzewczyk, BSlawinska, AMazurek, APMazurek, APlucinski, FWolska, IHerold, F Synthesis and biological investigation of potential atypical antipsychotics with a tropane core. Part 1. Eur J Med Chem 46:4474-88 (2011)  
Target
Name:
5-hydroxytryptamine receptor 1A
Synonyms:
5-HT-1A 5-HT1A 5-hydroxytryptamine receptor 1A (5HT1A) 5ht1a Htr1a Serotonin 1a (5-HT1a) receptor/Adrenergic receptor alpha-1 | Serotonin receptor 1A
Type:
G Protein-Coupled Receptor (GPCR)
Mol. Mass.:
46445.29
Organism:
Rattus norvegicus (rat)
Description:
Binding assays were performed using rat hippocampal membranes.
Residue:
422
  
Inhibitor
Name:
BDBM50354105
Synonyms:
CHEMBL1836110
Type:
Small organic molecule
Emp. Form.:
C22H27N3O3
Mol. Mass.:
381.4681
SMILES:
COc1cccc(C(=O)NC2C[C@H]3CC[C@H](C2)N3Cc2ccncc2)c1OC
: