Target
Histamine H3 receptor
Ligand
BDBM50355129
Substrate
Meas. Tech.
ChEMBL_772497 (CHEMBL1839389)
Ki
58±n/a nM
Citation
 Tao, MRaddatz, RAimone, LDHudkins, RL Synthesis and structure-activity relationships of 4,5-fused pyridazinones as histamine H3 receptor antagonists. Bioorg Med Chem Lett 21:6126-30 (2011)  
Target
Name:
Histamine H3 receptor
Synonyms:
HH3R Hrh3
Type:
G Protein-Coupled Receptor (GPCR)
Mol. Mass.:
48607.98
Organism:
Rattus norvegicus (rat)
Description:
Residue:
445
  
Inhibitor
Name:
BDBM50355129
Synonyms:
CHEMBL1835779
Type:
Small organic molecule
Emp. Form.:
C24H31N3O2S
Mol. Mass.:
425.587
SMILES:
CCCn1nc(-c2ccc(OCCCN3CCC(C)CC3)cc2)c2sccc2c1=O
: