Target
Histamine H3 receptor
Ligand
BDBM50355141
Substrate
Meas. Tech.
ChEMBL_772497 (CHEMBL1839389)
Ki
3.8±n/a nM
Citation
 Tao, MRaddatz, RAimone, LDHudkins, RL Synthesis and structure-activity relationships of 4,5-fused pyridazinones as histamine H3 receptor antagonists. Bioorg Med Chem Lett 21:6126-30 (2011)  
Target
Name:
Histamine H3 receptor
Synonyms:
HH3R Hrh3
Type:
G Protein-Coupled Receptor (GPCR)
Mol. Mass.:
48607.98
Organism:
Rattus norvegicus (rat)
Description:
Residue:
445
  
Inhibitor
Name:
BDBM50355141
Synonyms:
CHEMBL1835704
Type:
Small organic molecule
Emp. Form.:
C23H27N3O2
Mol. Mass.:
377.4794
SMILES:
C[C@@H]1CCCN1CCCOc1ccc(cc1)-c1nn(C)c(=O)c2ccccc12
: