Target
Beta-2 adrenergic receptor
Ligand
BDBM50379086
Substrate
Meas. Tech.
ChEMBL_809684 (CHEMBL2015995)
EC50
>3160±n/a nM
Citation
 Jesudason, CDBaker, JEBryant, RDFisher, JWGaich, GAHe, MMKahl, SDKriauciunas, AVHeiman, MLPeters, MARito, CJSatterwhite, JHTinsley, FCTrankle, WGShuker, AJ Combination of a Beta adrenoceptor modulator and a norepinephrine-serotonin uptake inhibitor for the treatment of obesity. ACS Med Chem Lett 2:583-586 (2011)  
Target
Name:
Beta-2 adrenergic receptor
Synonyms:
ADRB2 ADRB2_HUMAN Beta-2 adrenoceptor | Beta-2 adrenoreceptor
Type:
Mol. Mass.:
46461.69
Organism:
Homo sapiens (Human)
Description:
P07550
Residue:
413
  
Inhibitor
Name:
BDBM50379086
Synonyms:
CHEMBL2012521 LY-377604
Type:
Small organic molecule
Emp. Form.:
C31H32N4O4
Mol. Mass.:
524.6102
SMILES:
CC(C)(Cc1ccc(Oc2ccc(cn2)C(N)=O)cc1)NC[C@H](O)COc1cccc2[nH]c3ccccc3c12
: