Target
Adenosine receptor A3
Ligand
BDBM50379115
Substrate
Meas. Tech.
ChEMBL_812527 (CHEMBL2014402)
Ki
114±n/a nM
Citation
 Tosh, DKPhan, KDeflorian, FWei, QGao, ZGJacobson, KA Truncated (N)-Methanocarba Nucleosides as A(1) Adenosine Receptor Agonists and Partial Agonists: Overcoming Lack of a Recognition Element. ACS Med Chem Lett 2:626-631 (2011)  
Target
Name:
Adenosine receptor A3
Synonyms:
A3 adenosine receptor (hA3) ADORA3 | Adenosine A3 receptor (A3AR)
Type:
G Protein-Coupled Receptor (GPCR)
Mol. Mass.:
36197.32
Organism:
Homo sapiens (Human)
Description:
P0DMS8
Residue:
318
  
Inhibitor
Name:
BDBM50379115
Synonyms:
CHEMBL2012690
Type:
Small organic molecule
Emp. Form.:
C20H21ClFN5O3
Mol. Mass.:
433.864
SMILES:
O[C@@H]1[C@@H]2C[C@@H]2[C@H]([C@@H]1O)n1cnc2c(NCc3cccc(OCCF)c3)nc(Cl)nc12
: