Target
Adenosine receptor A1
Ligand
BDBM50379121
Substrate
Meas. Tech.
ChEMBL_812523 (CHEMBL2014359)
Ki
72.7±n/a nM
Citation
 Tosh, DKPhan, KDeflorian, FWei, QGao, ZGJacobson, KA Truncated (N)-Methanocarba Nucleosides as A(1) Adenosine Receptor Agonists and Partial Agonists: Overcoming Lack of a Recognition Element. ACS Med Chem Lett 2:626-631 (2011)  
Target
Name:
Adenosine receptor A1
Synonyms:
A1 adenosine receptor (hA1) AA1R_HUMAN ADORA1 Adenosine A1-receptor Adenosine receptor A1 (hA1) | Adenosine transporter (AdT)
Type:
G Protein-Coupled Receptor (GPCR)
Mol. Mass.:
36520.92
Organism:
Homo sapiens (Human)
Description:
P30542
Residue:
326
  
Inhibitor
Name:
BDBM50379121
Synonyms:
CHEMBL2012681
Type:
Small organic molecule
Emp. Form.:
C14H17ClFN5O2
Mol. Mass.:
341.768
SMILES:
O[C@@H]1[C@@H]2C[C@@H]2[C@H]([C@@H]1O)n1cnc2c(NCCCF)nc(Cl)nc12
: