Target
Ketohexokinase
Ligand
BDBM50380259
Substrate
Meas. Tech.
ChEMBL_813545 (CHEMBL2019654)
IC50
170±n/a nM
Citation
 Maryanoff, BEMcComsey, DFYabut, SCLuci, DKJordan, ADMasucci, JAJones, WJAbad, MCGibbs, ACPetrounia, I Inhibitors of Ketohexokinase: Discovery of Pyrimidinopyrimidines with Specific Substitution that Complements the ATP-Binding Site. ACS Med Chem Lett 2:538-543 (2011)  
Target
Name:
Ketohexokinase
Synonyms:
Hepatic fructokinase KHK_HUMAN Ketohexokinase (KHK) | Ketohexokinase (KHK) Isoform C
Type:
Enzyme Catalytic Domain
Mol. Mass.:
32521.64
Organism:
Homo sapiens (Human)
Description:
Residue:
298
  
Inhibitor
Name:
BDBM50380259
Synonyms:
CHEMBL2017225
Type:
Small organic molecule
Emp. Form.:
C20H23BrN8
Mol. Mass.:
455.354
SMILES:
Brc1ccccc1Nc1nc(nc2c(NCC3CC3)ncnc12)N1CCNCC1
: