Target
cAMP-dependent protein kinase catalytic subunit alpha
Ligand
BDBM50380246
Substrate
Meas. Tech.
ChEMBL_813575 (CHEMBL2019684)
IC50
>40000±n/a nM
Citation
 Maryanoff, BEMcComsey, DFYabut, SCLuci, DKJordan, ADMasucci, JAJones, WJAbad, MCGibbs, ACPetrounia, I Inhibitors of Ketohexokinase: Discovery of Pyrimidinopyrimidines with Specific Substitution that Complements the ATP-Binding Site. ACS Med Chem Lett 2:538-543 (2011)  
Target
Name:
cAMP-dependent protein kinase catalytic subunit alpha
Synonyms:
KAPCA_HUMAN PKACA cAMP-dependent protein kinase (PKA) cAMP-dependent protein kinase catalytic subunit alpha cAMP-dependent protein kinase catalytic subunit alpha (PKACA) cAMP-dependent protein kinase catalytic subunit alpha isoform 1 | cAMP-dependent protein kinase, alpha-catalytic subunit
Type:
Enzyme Catalytic Subunit
Mol. Mass.:
40598.73
Organism:
Homo sapiens (Human)
Description:
Residue:
351
  
Inhibitor
Name:
BDBM50380246
Synonyms:
CHEMBL2017214
Type:
Small organic molecule
Emp. Form.:
C21H26N8S
Mol. Mass.:
422.55
SMILES:
CSc1ccccc1Nc1nc(nc2c(NCC3CC3)ncnc12)N1CCNCC1
: