Target
Sigma non-opioid intracellular receptor 1
Ligand
BDBM50248926
Substrate
Meas. Tech.
ChEMBL_812735 (CHEMBL2019953)
Ki
0.098±n/a nM
Citation
 Laurini, ECol, VDMamolo, MGZampieri, DPosocco, PFermeglia, MVio, LPricl, S Homology Model and Docking-Based Virtual Screening for Ligands of the s1 Receptor. ACS Med Chem Lett 2:834-839 (2011)  
Target
Name:
Sigma non-opioid intracellular receptor 1
Synonyms:
Opioid receptor SGMR1_RAT Sigma non-opioid intracellular receptor 1 Sigma-1 | Sigmar1
Type:
Enzyme Catalytic Domain
Mol. Mass.:
25266.54
Organism:
RAT
Description:
Q9R0C9
Residue:
223
  
Inhibitor
Name:
BDBM50248926
Synonyms:
3-((1-(4-chlorobenzyl)piperidin-4-yl)methyl)benzo[d]oxazol-2(3H)-one CHEMBL473783
Type:
Small organic molecule
Emp. Form.:
C20H21ClN2O2
Mol. Mass.:
356.846
SMILES:
Clc1ccc(CN2CCC(Cn3c4ccccc4oc3=O)CC2)cc1
: