Target
High affinity cAMP-specific 3',5'-cyclic phosphodiesterase 7A
Ligand
BDBM50380637
Substrate
Meas. Tech.
ChEMBL_813181 (CHEMBL2020847)
Ki
550±n/a nM
Citation
 Ho, GDMichael Seganish, WBercovici, ATulshian, DGreenlee, WJVan Rijn, RHruza, AXiao, LRindgen, DMullins, DGuzzi, MZhang, XBleickardt, CHodgson, R The SAR development of dihydroimidazoisoquinoline derivatives as phosphodiesterase 10A inhibitors for the treatment of schizophrenia. Bioorg Med Chem Lett 22:2585-9 (2012)  
Target
Name:
High affinity cAMP-specific 3',5'-cyclic phosphodiesterase 7A
Synonyms:
3',5'-cyclic phosphodiesterase PDE7A_HUMAN Phosphodiesterase 7 (PDE7) Phosphodiesterase 7A (PDE7A1)
Type:
Enzyme
Mol. Mass.:
55514.96
Organism:
Homo sapiens (Human)
Description:
Q13946
Residue:
482
  
Inhibitor
Name:
BDBM50380637
Synonyms:
CHEMBL2017061
Type:
Small organic molecule
Emp. Form.:
C22H24N4O4S
Mol. Mass.:
440.515
SMILES:
COc1cc2CCn3cnc(-c4cnc(s4)C(=O)NC4CCOCC4)c3-c2cc1OC
: