Target
Pancreatic triacylglycerol lipase
Ligand
BDBM50381858
Substrate
Meas. Tech.
ChEMBL_817316 (CHEMBL2025941)
Ki
550000±n/a nM
Citation
 Park, SYu, J An approach for differentiating isozymes. Construction of libraries containing short aromatic peptides as part of a method to design selective inhibitors against lipases. Bioorg Med Chem Lett 22:3147-51 (2012)  
Target
Name:
Pancreatic triacylglycerol lipase
Synonyms:
LIPP_HUMAN PNLIP | Pancreatic lipase
Type:
PROTEIN
Mol. Mass.:
51157.75
Organism:
Homo sapiens (Human)
Description:
ChEMBL_527250
Residue:
465
  
Inhibitor
Name:
BDBM50381858
Synonyms:
CHEMBL2022679
Type:
Small organic molecule
Emp. Form.:
C32H38N4O6
Mol. Mass.:
574.6673
SMILES:
CCCCOc1ccc(NC(=O)CCC(=O)N[C@@H](Cc2ccccc2)C(=O)N[C@@H](Cc2ccc(O)cc2)C(N)=O)cc1
: