Target
Adenosine receptor A2a
Ligand
BDBM50382489
Substrate
Meas. Tech.
ChEMBL_816161 (CHEMBL2024727)
Ki
3.98±n/a nM
Citation
 Congreve, MAndrews, SPDoré, ASHollenstein, KHurrell, ELangmead, CJMason, JSNg, IWTehan, BZhukov, AWeir, MMarshall, FH Discovery of 1,2,4-triazine derivatives as adenosine A(2A) antagonists using structure based drug design. J Med Chem 55:1898-903 (2012)  
Target
Name:
Adenosine receptor A2a
Synonyms:
A2A adenosine receptor (hA2A) ADENOSINE A2 ADORA2 Adenosine A2A receptor (A2AAR)
Type:
G Protein-Coupled Receptor (GPCR)
Mol. Mass.:
44716.46
Organism:
Homo sapiens (Human)
Description:
P29274
Residue:
412
  
Inhibitor
Name:
BDBM50382489
Synonyms:
CHEMBL2024112 | US10988455, Example 1(xiii)
Type:
Small organic molecule
Emp. Form.:
C15H10Cl2N4
Mol. Mass.:
317.173
SMILES:
Nc1nnc(-c2cc(Cl)cc(Cl)c2)c(n1)-c1ccccc1
: