Target
Carbonic anhydrase 12
Ligand
BDBM50382722
Substrate
Meas. Tech.
ChEMBL_817440 (CHEMBL2027663)
Ki
0.78±n/a nM
Citation
 Carta, FAggarwal, MMaresca, AScozzafava, AMcKenna, RMasini, ESupuran, CT Dithiocarbamates strongly inhibit carbonic anhydrases and show antiglaucoma action in vivo. J Med Chem 55:1721-30 (2012)  
Target
Name:
Carbonic anhydrase 12
Synonyms:
CA-XII CAH12_HUMAN Carbonic anhydrase Carbonic anhydrase XII Carbonic anhydrase XII (CAXII) | Tumor antigen HOM-RCC-3.1.3
Type:
Enzyme
Mol. Mass.:
39456.00
Organism:
Homo sapiens (Human)
Description:
Catalytic domain of human cloned isozyme was used in the assay
Residue:
354
  
Inhibitor
Name:
BDBM50382722
Synonyms:
CHEMBL2023728
Type:
Small organic molecule
Emp. Form.:
C6H8N2S4
Mol. Mass.:
236.402
SMILES:
[S-]C(=S)N1CCN(CC1)C([S-])=S
: