Target
NT-3 growth factor receptor
Ligand
BDBM50384721
Substrate
Meas. Tech.
ChEMBL_820921 (CHEMBL2038862)
IC50
40±n/a nM
Citation
 Albaugh, PFan, YMi, YSun, FAdrian, FLi, NJia, YSarkisova, YKreusch, AHood, TLu, MLiu, GHuang, SLiu, ZLoren, JTuntland, TKaranewsky, DSSeidel, HMMolteni, V Discovery of GNF-5837, a Selective TRK Inhibitor with Efficacy in Rodent Cancer Tumor Models. ACS Med Chem Lett 3:140-145 (2012)  
Target
Name:
NT-3 growth factor receptor
Synonyms:
GP145-TrkC NTRK3_HUMAN Neurotrophic tyrosine kinase receptor type 3 Trk-C Tyrosine kinase receptor C (Trk-C)
Type:
Enzyme
Mol. Mass.:
94428.15
Organism:
Homo sapiens (Human)
Description:
Q16288
Residue:
839
  
Inhibitor
Name:
BDBM50384721
Synonyms:
CHEMBL2037224
Type:
Small organic molecule
Emp. Form.:
C27H20F3N5O2
Mol. Mass.:
503.4752
SMILES:
FC(F)(F)c1cccc(NC(=O)Nc2cccc(Nc3ccc4\C(=C\c5ccc[nH]5)C(=O)Nc4c3)c2)c1
: