Target
11-beta-hydroxysteroid dehydrogenase type 2
Ligand
BDBM50247012
Substrate
Meas. Tech.
ChEMBL_821682 (CHEMBL2038878)
IC50
206±n/a nM
Citation
 Mpetga, JDShen, YTane, PLi, SFHe, HPWabo, HKTene, MLeng, YHao, XJ Cycloartane and friedelane triterpenoids from the leaves of Caloncoba glauca and their evaluation for inhibition of 11ß-hydroxysteroid dehydrogenases. J Nat Prod 75:599-604 (2012)  
Target
Name:
11-beta-hydroxysteroid dehydrogenase type 2
Synonyms:
11-DH2 11-beta-Hydroxysteroid Dehydrogenase 2 (11-beta-HSD2) Corticosteroid 11-beta-dehydrogenase isozyme 2 Hsd11b2 NAD-dependent 11-beta-hydroxysteroid dehydrogenase
Type:
Enzyme
Mol. Mass.:
42201.46
Organism:
Mus musculus (mouse)
Description:
Purified recombinant mouse 11beta-HSD2.
Residue:
386
  
Inhibitor
Name:
BDBM50247012
Synonyms:
3beta-O-Succinyl-18-beta-glycyrrhetinic acid US11660306, Example Carbeanoxolone
Type:
Small organic molecule
Emp. Form.:
C34H50O7
Mol. Mass.:
570.7566
SMILES:
CC1(C)[C@H](CC[C@@]2(C)[C@H]1CC[C@]1(C)[C@@H]2C(=O)C=C2[C@@H]3C[C@](C)(CC[C@]3(C)CC[C@@]12C)C(O)=O)OC(=O)CCC(O)=O
: