Target
Calcitonin gene-related peptide type 1 receptor
Ligand
BDBM50385310
Substrate
Meas. Tech.
ChEMBL_822689 (CHEMBL2040006)
Ki
60±n/a nM
Citation
 Bell, IMStump, CAGallicchio, SNStaas, DDZartman, CBMoore, ELSain, NUrban, MBruno, JGCalamari, AKemmerer, ALMosser, SDFandozzi, CWhite, RBZrada, MMSelnick, HGGraham, SLVacca, JPKane, SASalvatore, CA MK-8825: a potent and selective CGRP receptor antagonist with good oral activity in rats. Bioorg Med Chem Lett 22:3941-5 (2012)  
Target
Name:
Calcitonin gene-related peptide type 1 receptor
Synonyms:
CALRL_RAT Calcrl | Cgrpr
Type:
PROTEIN
Mol. Mass.:
53330.91
Organism:
Rattus norvegicus
Description:
ChEMBL_1457286
Residue:
464
  
Inhibitor
Name:
BDBM50385310
Synonyms:
CHEMBL2035986
Type:
Small organic molecule
Emp. Form.:
C32H32F2N6O3
Mol. Mass.:
586.6317
SMILES:
CC[C@]1(CNC2(CCCC2)C(=O)N1CC(=O)Nc1cnc2C[C@]3(Cc2c1)C(=O)Nc1ncccc31)c1cc(F)cc(F)c1
: