Target
Adenosine receptor A1
Ligand
BDBM50385956
Substrate
Meas. Tech.
ChEMBL_824764 (CHEMBL2044691)
IC50
413267±n/a nM
Citation
 Hausler, NEDevine, SMMcRobb, FMWarfe, LPouton, CWHaynes, JMBottle, SEWhite, PJScammells, PJ Synthesis and pharmacological evaluation of dual acting antioxidant A(2A) adenosine receptor agonists. J Med Chem 55:3521-34 (2012)  
Target
Name:
Adenosine receptor A1
Synonyms:
A1 adenosine receptor (hA1) AA1R_HUMAN ADORA1 Adenosine A1-receptor Adenosine receptor A1 (hA1) | Adenosine transporter (AdT)
Type:
G Protein-Coupled Receptor (GPCR)
Mol. Mass.:
36520.92
Organism:
Homo sapiens (Human)
Description:
P30542
Residue:
326
  
Inhibitor
Name:
BDBM50385956
Synonyms:
CHEMBL2042312
Type:
Small organic molecule
Emp. Form.:
C48H56N8O6
Mol. Mass.:
841.0082
SMILES:
CNC(=O)[C@H]1O[C@H]([C@H](O)[C@@H]1O)n1cnc2c(NCC(c3ccccc3)c3ccccc3)nc(NCCc3ccc(NC(=O)c4cc(c(O)c(c4)C(C)(C)C)C(C)(C)C)cc3)nc12
: