Target
Adenosine receptor A2a
Ligand
BDBM50385954
Substrate
Meas. Tech.
ChEMBL_824762 (CHEMBL2044689)
EC50
89.7±n/a nM
Citation
 Hausler, NEDevine, SMMcRobb, FMWarfe, LPouton, CWHaynes, JMBottle, SEWhite, PJScammells, PJ Synthesis and pharmacological evaluation of dual acting antioxidant A(2A) adenosine receptor agonists. J Med Chem 55:3521-34 (2012)  
Target
Name:
Adenosine receptor A2a
Synonyms:
A2A adenosine receptor (hA2A) ADENOSINE A2 ADORA2 Adenosine A2A receptor (A2AAR)
Type:
G Protein-Coupled Receptor (GPCR)
Mol. Mass.:
44716.46
Organism:
Homo sapiens (Human)
Description:
P29274
Residue:
412
  
Inhibitor
Name:
BDBM50385954
Synonyms:
CHEMBL2042310
Type:
Small organic molecule
Emp. Form.:
C42H50N8O5S2
Mol. Mass.:
811.027
SMILES:
CCNC(=O)[C@H]1O[C@H]([C@H](O)[C@@H]1O)n1cnc2c(NCC(c3ccccc3)c3ccccc3)nc(NCCc3ccc(NC(=O)CCCC[C@H]4CCSS4)cc3)nc12
: