Target
Tyrosine-protein kinase BTK
Ligand
BDBM50388190
Substrate
Meas. Tech.
ChEMBL_828864 (CHEMBL2060514)
IC50
1±n/a nM
Citation
 Lou, YOwens, TDKuglstatter, AKondru, RKGoldstein, DM Bruton's tyrosine kinase inhibitors: approaches to potent and selective inhibition, preclinical and clinical evaluation for inflammatory diseases and B cell malignancies. J Med Chem 55:4539-50 (2012)  
Target
Name:
Tyrosine-protein kinase BTK
Synonyms:
AGMX1 Agammaglobulinaemia tyrosine kinase B cell progenitor kinase BPK BTK_HUMAN Tyrosine Kinase BTK Tyrosine-protein kinase BTK (BTK)
Type:
Enzyme
Mol. Mass.:
76289.95
Organism:
Homo sapiens (Human)
Description:
Q06187
Residue:
659
  
Inhibitor
Name:
BDBM50388190
Synonyms:
CHEMBL2057923
Type:
Small organic molecule
Emp. Form.:
C25H18N4O3
Mol. Mass.:
422.4354
SMILES:
Nc1[nH]nc2cc(nc(-c3ccc(Oc4ccccc4)cc3)c12)-c1ccc(cc1)C(O)=O
: