Target
Tyrosine-protein kinase Lck
Ligand
BDBM50388872
Substrate
Meas. Tech.
ChEMBL_830841 (CHEMBL2065347)
Ki
79±n/a nM
Citation
 Milletti, FHermann, JC Targeted kinase selectivity from kinase profiling data. ACS Med Chem Lett 3:383-386 (2012)  
Target
Name:
Tyrosine-protein kinase Lck
Synonyms:
2.7.10.2 LCK_HUMAN Leukocyte C-terminal Src kinase Lymphocyte-specific protein tyrosine kinase Protein YT16 Proto-oncogene tyrosine-protein kinase LCK T cell-specific protein-tyrosine kinase
Type:
Mol. Mass.:
57987.83
Organism:
Homo sapiens (Human)
Description:
P06239
Residue:
509
  
Inhibitor
Name:
BDBM50388872
Synonyms:
CHEMBL2062938
Type:
Small organic molecule
Emp. Form.:
C33H28ClN7O2S
Mol. Mass.:
622.139
SMILES:
Clc1ccc(cc1NC(=O)Cc1ccccc1)-c1nc2sccn2c1-c1ccnc(Nc2ccc(cc2)N2CCOCC2)n1
: