Target
Platelet-derived growth factor receptor alpha
Ligand
BDBM50388873
Substrate
Meas. Tech.
ChEMBL_830844 (CHEMBL2065350)
Ki
2.5±n/a nM
Citation
 Milletti, FHermann, JC Targeted kinase selectivity from kinase profiling data. ACS Med Chem Lett 3:383-386 (2012)  
Target
Name:
Platelet-derived growth factor receptor alpha
Synonyms:
Alpha-type platelet-derived growth factor receptor PDGFRA PGFRA_HUMAN Platelet-derived growth factor receptor alpha (PDGFRA) RHEPDGFRA
Type:
Protein
Mol. Mass.:
122633.38
Organism:
Homo sapiens (Human)
Description:
P16234
Residue:
1089
  
Inhibitor
Name:
BDBM50388873
Synonyms:
CHEMBL1964441
Type:
Small organic molecule
Emp. Form.:
C25H23N5OS
Mol. Mass.:
441.548
SMILES:
CNCC#Cc1cnc(N)c2c(csc12)-c1ccc(NC(=O)Nc2cccc(C)c2)cc1
: