Target
Macrophage colony-stimulating factor 1 receptor
Ligand
BDBM50388880
Substrate
Meas. Tech.
ChEMBL_830843 (CHEMBL2065349)
Ki
7.9±n/a nM
Citation
 Milletti, FHermann, JC Targeted kinase selectivity from kinase profiling data. ACS Med Chem Lett 3:383-386 (2012)  
Target
Name:
Macrophage colony-stimulating factor 1 receptor
Synonyms:
CSF1R FMS Macrophage colony stimulating factor receptor Macrophage colony-stimulating factor 1 receptor (c-FMS) Proto-oncogene c-Fms c-fms | cFMS
Type:
Protein
Mol. Mass.:
107979.48
Organism:
Homo sapiens (Human)
Description:
P07333
Residue:
972
  
Inhibitor
Name:
BDBM50388880
Synonyms:
CHEMBL1979577
Type:
Small organic molecule
Emp. Form.:
C26H25N5OS
Mol. Mass.:
455.575
SMILES:
Cc1cccc(NC(=O)Nc2ccc(cc2)-c2csc3c(cnc(N)c23)C#CC(C)(C)N)c1
: